Usage level]: Required:50.00, ThermalPolicy, policyWeight: 5.000, response: {Decision: Absolutely Must Not Proceed, Score: 0.00, Rationale: [{thermalLevel >= 2}

fehler 21:55:59.672988 +0100 nsurlsessiond nw_protocol_boringssl_get_output_frames(1301) <private>[0x7f990b626f50] get output frames failed, state 8196

fehler 21:55:59.673093 +0100 nsurlsessiond nw_protocol_boringssl_get_output_frames(1301) <private>[0x7f990b626f50] get output frames failed, state 8196

fehler 21:55:59.673648 +0100 nsurlsessiond TIC Read Status [29:0x0]: 1:57

fehler 21:55:59.673692 +0100 nsurlsessiond TIC Read Status [29:0x0]: 1:57

fehler 21:56:08.742053 +0100 com.apple.appkit.xpc.openAndSavePanelService Unable to load Info.plist exceptions (eGPUOverrides)

fehler 21:56:11.316882 +0100 WindowServer SLXServer: Unexpected notification msg received: id is 65

fehler 21:56:12.444087 +0100 sandboxd Sandbox: mdworker(1406) System Policy: deny(1) file-read-data /Users/severinkampfer/Library/Mail

Violation:       System Policy: deny(1) file-read-data /Users/severinkampfer/Library/Mail 

Process:         mdworker [1406]

Path:            /System/Library/Frameworks/CoreServices.framework/Frameworks/Metadata.framework/Versions/A/Support/mdworker

Load Address:    0x10af80000

Identifier:      mdworker

Version:         ??? (???)

Code Type:       x86_64 (Native)

Parent Process:  launchd [1]

Responsible:     /System/Library/Frameworks/CoreServices.framework/Frameworks/Metadata.framework/Versions/A/Support/mdworker [1406]

User ID:         501

MetaData: {"storage-class":"Mail","profile-flags":0,"process":"mdworker","path":"\/Users\/severinkampfer\/Library\/Mail","errno":1,"summary":"deny(1) file-read-data \/Users\/severinkampfer\/Library\/Mail","normalized_target":["Users","severinkampfer","Library","Mail"],"build":"Mac OS X 10.14 (18A377a)","primary-filter-value":"\/Users\/severinkampfer\/Library\/Mail","flags":69,"platform-policy":true,"pid":1406,"hardware":"Mac","rdev":0,"signing-id":"com.apple.mdworker","file-flags":0,"uid":501,"operation":"file-read-data","profile":"platform","platform-binary":true,"target":"\/Users\/severinkampfer\/Library\/Mail","responsible-process-pid":1406,"platform_binary":"yes","responsible-process-path":"\/System\/Library\/Frameworks\/CoreServices.framework\/Frameworks\/Metadata.framework\/Versions\/A\/Support\/mdworker","primary-filter":"path","action":"deny","process-path":"\/System\/Library\/Frameworks\/CoreServices.framework\/Versions\/A\/Frameworks\/Metadata.framework\/Versions\/A\/Support\/mdworker","vnode-type":"DIRECTORY"}

 

Thread 0 (id: 18384):

0   libsystem_kernel.dylib       0x00007fff5ed14c2a mach_msg_trap + 10

1   CoreFoundation               0x00007fff31c0405e __CFRunLoopServiceMachPort + 337

2   CoreFoundation               0x00007fff31c035ad __CFRunLoopRun + 1654

3   CoreFoundation               0x00007fff31c02ce4 CFRunLoopRunSpecific + 463

4   CoreFoundation               0x00007fff31c02af0 CFRunLoopRun + 40

5   mdworker                     0x000000010af899f7

6   libdyld.dylib                0x00007fff5ebdc0a1 start + 1

7   mdworker                     0x0000000000000007

 

Thread 1 (id: 18386):

0   libsystem_kernel.dylib       0x00007fff5ed15bce __open + 10

1   mdworker                     0x000000010af8b44a

2   mdworker                     0x000000010af8ac05

3   mdworker                     0x000000010af8f768

4   Metadata                     0x00007fff333e1207 mach_msg_dispatch + 162

5   SpotlightServerKit           0x00007fff588696c8 mdsObjectMsgCallback + 209

6   SpotlightServerKit           0x00007fff58868f93 __53-[MDSMachSubsystem registerPort:withCallback:rights:]_block_invoke + 135

7   libdispatch.dylib            0x00007fff5eb8ee6b _dispatch_client_callout4 + 9

8   libdispatch.dylib            0x00007fff5eba3b02 _dispatch_mach_msg_invoke + 448

9   libdispatch.dylib            0x00007fff5eb94fc5 _dispatch_lane_serial_drain + 271

10  libdispatch.dylib            0x00007fff5eba4639 _dispatch_mach_invoke + 485

11  libdispatch.dylib            0x00007fff5eb94fc5 _dispatch_lane_serial_drain + 271

12  libdispatch.dylib            0x00007fff5eb95c08 _dispatch_lane_invoke + 436

13  libdispatch.dylib            0x00007fff5eb90ec8 _dispatch_workloop_stealer_invoke + 315

14  libdispatch.dylib            0x00007fff5eb96a33 _dispatch_workloop_invoke + 917

15  libdispatch.dylib            0x00007fff5eb9e084 _dispatch_workloop_worker_thread + 603

16  libsystem_pthread.dylib      0x00007fff5edcd61c _pthread_wqthread + 409

17  libsystem_pthread.dylib      0x00007fff5edcd415 start_wqthread + 13

 

Thread 2 (id: 18387):

0   libsystem_kernel.dylib       0x00007fff5ed165be __workq_kernreturn + 10

1   libsystem_pthread.dylib      0x00007fff5edcd415 start_wqthread + 13

2   mdworker                     0x0000000000000001

 

Binary Images:

       0x10af80000 -        0x10afd0ff7  mdworker (1191.51) <9bac8499-c78b-3820-a633-710aaaf26719> /System/Library/Frameworks/CoreServices.framework/Frameworks/Metadata.framework/Versions/A/Support/mdworker

    0x7fff31bc8000 -     0x7fff32017fff  com.apple.CoreFoundation (6.9 - 1555.10) <1b4033fd-d37e-3613-84ac-464b532167ef> /System/Library/Frameworks/CoreFoundation.framework/Versions/A/CoreFoundation

    0x7fff333df000 -     0x7fff33481ffb  com.apple.Metadata (10.7.0 - 1191.51) <0423d056-92cb-3341-9b98-6e3918215890> /System/Library/Frameworks/CoreServices.framework/Versions/A/Frameworks/Metadata.framework/Versions/A/Metadata

    0x7fff58867000 -     0x7fff58876ffb  com.apple.metadata.SpotlightServerKit (1.0 - 1191.51) <8f9415a2-c25f-3c47-8c92-7f33f74628b0> /System/Library/PrivateFrameworks/SpotlightServerKit.framework/Versions/A/SpotlightServerKit

    0x7fff5eb8b000 -     0x7fff5ebc5ff7  libdispatch.dylib (1008.200.78) <2d6d60ae-94f0-3b80-9ac3-cc242ad41edc> /usr/lib/system/libdispatch.dylib

    0x7fff5ebc6000 -     0x7fff5ebf4fff  libdyld.dylib (625.13) <44eff046-f584-3ac2-ac79-0fcc9dcdc419> /usr/lib/system/libdyld.dylib

    0x7fff5ed14000 -     0x7fff5ed3bff7  libsystem_kernel.dylib (4903.201.2) <4999918f-ee77-3e3d-a693-a0645638cc4e> /usr/lib/system/libsystem_kernel.dylib

    0x7fff5edcb000 -     0x7fff5edd5fff  libsystem_pthread.dylib (330.201.1) <c4485fbb-6cce-3a2e-8512-fdabc5971f65> /usr/lib/system/libsystem_pthread.dylib

fehler 21:56:12.483680 +0100 sandboxd Sandbox: mdworker(1406) System Policy: deny(1) file-read-data /Users/severinkampfer/Library/Mail/V6

Violation:       System Policy: deny(1) file-read-data /Users/severinkampfer/Library/Mail/V6 

Process:         mdworker [1406]

Path:            /System/Library/Frameworks/CoreServices.framework/Frameworks/Metadata.framework/Versions/A/Support/mdworker

Load Address:    0x10af80000

Identifier:      mdworker

Version:         ??? (???)

Code Type:       x86_64 (Native)

Parent Process:  launchd [1]

Responsible:     /System/Library/Frameworks/CoreServices.framework/Frameworks/Metadata.framework/Versions/A/Support/mdworker [1406]

User ID:         501

 

Date/Time:       2018-11-06 21:56:12.456 GMT+1

OS Version:      Mac OS X 10.14 (18A377a)

Report Version:  8

 

 

MetaData: {"storage-class":"Mail","profile-flags":0,"process":"mdworker","path":"\/Users\/severinkampfer\/Library\/Mail\/V6","errno":1,"summary":"deny(1) file-read-data \/Users\/severinkampfer\/Library\/Mail\/V6","normalized_target":["Users","severinkampfer","Library","Mail","V6"],"build":"Mac OS X 10.14 (18A377a)","primary-filter-value":"\/Users\/severinkampfer\/Library\/Mail\/V6","flags":69,"platform-policy":true,"pid":1406,"hardware":"Mac","rdev":0,"signing-id":"com.apple.mdworker","file-flags":0,"uid":501,"operation":"file-read-data","profile":"platform","platform-binary":true,"target":"\/Users\/severinkampfer\/Library\/Mail\/V6","responsible-process-pid":1406,"platform_binary":"yes","responsible-process-path":"\/System\/Library\/Frameworks\/CoreServices.framework\/Frameworks\/Metadata.framework\/Versions\/A\/Support\/mdworker","primary-filter":"path","action":"deny","process-path":"\/System\/Library\/Frameworks\/CoreServices.framework\/Versions\/A\/Frameworks\/Metadata.framework\/Versions\/A\/Support\/mdworker","vnode-type":"DIRECTORY"}

 

Thread 0 (id: 18384):

0   libsystem_kernel.dylib       0x00007fff5ed14c2a mach_msg_trap + 10

1   CoreFoundation               0x00007fff31c0405e __CFRunLoopServiceMachPort + 337

2   CoreFoundation               0x00007fff31c035ad __CFRunLoopRun + 1654

3   CoreFoundation               0x00007fff31c02ce4 CFRunLoopRunSpecific + 463

4   CoreFoundation               0x00007fff31c02af0 CFRunLoopRun + 40

5   mdworker                     0x000000010af899f7

6   libdyld.dylib                0x00007fff5ebdc0a1 start + 1

7   mdworker                     0x0000000000000007

 

Thread 1 (id: 18386):

0   libsystem_kernel.dylib       0x00007fff5ed15bce __open + 10

1   mdworker                     0x000000010af8b44a

2   mdworker                     0x000000010af8ac22

3   mdworker                     0x000000010af8f768

4   Metadata                     0x00007fff333e1207 mach_msg_dispatch + 162

5   SpotlightServerKit           0x00007fff588696c8 mdsObjectMsgCallback + 209

6   SpotlightServerKit           0x00007fff58868f93 __53-[MDSMachSubsystem registerPort:withCallback:rights:]_block_invoke + 135

7   libdispatch.dylib            0x00007fff5eb8ee6b _dispatch_client_callout4 + 9

8   libdispatch.dylib            0x00007fff5eba3b02 _dispatch_mach_msg_invoke + 448

9   libdispatch.dylib            0x00007fff5eb94fc5 _dispatch_lane_serial_drain + 271

10  libdispatch.dylib            0x00007fff5eba4639 _dispatch_mach_invoke + 485

11  libdispatch.dylib            0x00007fff5eb94fc5 _dispatch_lane_serial_drain + 271

12  libdispatch.dylib            0x00007fff5eb95c08 _dispatch_lane_invoke + 436

13  libdispatch.dylib            0x00007fff5eb90ec8 _dispatch_workloop_stealer_invoke + 315

14  libdispatch.dylib            0x00007fff5eb96a33 _dispatch_workloop_invoke + 917

15  libdispatch.dylib            0x00007fff5eb9e084 _dispatch_workloop_worker_thread + 603

16  libsystem_pthread.dylib      0x00007fff5edcd61c _pthread_wqthread + 409

17  libsystem_pthread.dylib      0x00007fff5edcd415 start_wqthread + 13

 

Thread 2 (id: 18387):

0   libsystem_kernel.dylib       0x00007fff5ed165be __workq_kernreturn + 10

1   libsystem_pthread.dylib      0x00007fff5edcd415 start_wqthread + 13

2   mdworker                     0x0000000000000001

 

Binary Images:

       0x10af80000 -        0x10afd0ff7  mdworker (1191.51) <9bac8499-c78b-3820-a633-710aaaf26719> /System/Library/Frameworks/CoreServices.framework/Frameworks/Metadata.framework/Versions/A/Support/mdworker

    0x7fff31bc8000 -     0x7fff32017fff  com.apple.CoreFoundation (6.9 - 1555.10) <1b4033fd-d37e-3613-84ac-464b532167ef> /System/Library/Frameworks/CoreFoundation.framework/Versions/A/CoreFoundation

    0x7fff333df000 -     0x7fff33481ffb  com.apple.Metadata (10.7.0 - 1191.51) <0423d056-92cb-3341-9b98-6e3918215890> /System/Library/Frameworks/CoreServices.framework/Versions/A/Frameworks/Metadata.framework/Versions/A/Metadata

    0x7fff58867000 -     0x7fff58876ffb  com.apple.metadata.SpotlightServerKit (1.0 - 1191.51) <8f9415a2-c25f-3c47-8c92-7f33f74628b0> /System/Library/PrivateFrameworks/SpotlightServerKit.framework/Versions/A/SpotlightServerKit

    0x7fff5eb8b000 -     0x7fff5ebc5ff7  libdispatch.dylib (1008.200.78) <2d6d60ae-94f0-3b80-9ac3-cc242ad41edc> /usr/lib/system/libdispatch.dylib

    0x7fff5ebc6000 -     0x7fff5ebf4fff  libdyld.dylib (625.13) <44eff046-f584-3ac2-ac79-0fcc9dcdc419> /usr/lib/system/libdyld.dylib

    0x7fff5ed14000 -     0x7fff5ed3bff7  libsystem_kernel.dylib (4903.201.2) <4999918f-ee77-3e3d-a693-a0645638cc4e> /usr/lib/system/libsystem_kernel.dylib

    0x7fff5edcb000 -     0x7fff5edd5fff  libsystem_pthread.dylib (330.201.1) <c4485fbb-6cce-3a2e-8512-fdabc5971f65> /usr/lib/system/libsystem_pthread.dylib

fehler 21:56:15.293646 +0100 nsurlsessiond nw_parameters_set_source_application_by_bundle_id Failed to convert from bundle ID (com.apple.Pages) to UUID. This could lead to wrong data usage accounting.

fehler 21:56:15.305401 +0100 nsurlsessiond nw_endpoint_flow_validate_delegation [C31.1 IPv4#54c863bb:443 in_progress socket-flow (satisfied)] Network Delegation Failure: Invalid Bundle ID "com.apple.Pages" [M]

fehler 21:56:15.410921 +0100 nsurlsessiond boringssl_session_errorlog(224) <private>[0x7f990b64f6a0] [boringssl_session_read] SSL_ERROR_SSL(1): operation failed within the library

fehler 21:56:15.410979 +0100 nsurlsessiond boringssl_session_handshake_error_print(205) <private>[0x7f990b64f6a0] <private>

fehler 21:56:15.411038 +0100 nsurlsessiond boringssl_session_errorlog(224) <private>[0x7f990b64f6a0] [boringssl_session_read] SSL_ERROR_SSL(1): operation failed within the library

fehler 21:56:15.411096 +0100 nsurlsessiond boringssl_session_handshake_error_print(205) <private>[0x7f990b64f6a0] <private>

fehler 21:56:15.413565 +0100 nsurlsessiond boringssl_session_errorlog(224) <private>[0x7f990b64f6a0] [boringssl_session_read] SSL_ERROR_SSL(1): operation failed within the library

fehler 21:56:15.413631 +0100 nsurlsessiond boringssl_session_handshake_error_print(205) <private>[0x7f990b64f6a0] <private>

fehler 21:56:15.413693 +0100 nsurlsessiond boringssl_session_errorlog(224) <private>[0x7f990b64f6a0] [boringssl_session_read] SSL_ERROR_SSL(1): operation failed within the library

fehler 21:56:15.413776 +0100 nsurlsessiond boringssl_session_handshake_error_print(205) <private>[0x7f990b64f6a0] <private>

fehler 21:56:18.023006 +0100 nsurlsessiond nw_protocol_boringssl_get_output_frames(1301) <private>[0x7f990b64f6a0] get output frames failed, state 8196

fehler 21:56:18.023075 +0100 nsurlsessiond nw_protocol_boringssl_get_output_frames(1301) <private>[0x7f990b64f6a0] get output frames failed, state 8196

fehler 21:56:18.023525 +0100 nsurlsessiond TIC Read Status [31:0x0]: 1:57

fehler 21:56:18.023566 +0100 nsurlsessiond TIC Read Status [31:0x0]: 1:57

problem 21:56:19.170208 +0100 quicklookd Failed to generate image with request <private>

problem 21:56:19.181410 +0100 quicklookd Failed to generate image with request <private>

fehler 21:56:21.177174 +0100 sandboxd Sandbox: avguard.bin(1410) System Policy: deny(1) file-read-data /Library/Application Support/com.apple.TCC/TCC.db

Violation:       System Policy: deny(1) file-read-data /Library/Application Support/com.apple.TCC/TCC.db 

Process:         avguard.bin [1410]

Path:            /Applications/Avira.app/Contents/guard/avguard.bin

Load Address:    0x10ea75000

Identifier:      avguard.bin

Version:         ??? (???)

Code Type:       x86_64 (Native)

Parent Process:  avwatchdox [70]

Responsible:     /Library/Application Support/Avira/Services/Avira Services.app/Contents/MacOS/avwatchdox [70]

User ID:         0

 

Date/Time:       2018-11-06 21:56:21.174 GMT+1

OS Version:      Mac OS X 10.14 (18A377a)

Report Version:  8

 

 

MetaData: {"storage-class":"TCC","profile-flags":0,"process":"avguard.bin","path":"\/Library\/Application Support\/com.apple.TCC\/TCC.db","errno":1,"summary":"deny(1) file-read-data \/Library\/Application Support\/com.apple.TCC\/TCC.db","normalized_target":["Library","Application Support","com.apple.TCC","TCC.db"],"build":"Mac OS X 10.14 (18A377a)","primary-filter-value":"\/Library\/Application Support\/com.apple.TCC\/TCC.db","flags":69,"platform-policy":true,"pid":1410,"hardware":"Mac","rdev":0,"file-flags":524288,"uid":0,"operation":"file-read-data","profile":"platform","platform-binary":false,"target":"\/Library\/Application Support\/com.apple.TCC\/TCC.db","responsible-process-pid":70,"platform_binary":"no","responsible-process-path":"\/Library\/Application Support\/Avira\/Services\/Avira Services.app\/Contents\/MacOS\/avwatchdox","primary-filter":"path","action":"deny","process-path":"\/Applications\/Avira.app\/Contents\/guard\/avguard.bin","vnode-type":"REGULAR-FILE"}

 

Thread 0 (id: 18496):

0   libsystem_kernel.dylib       0x00007fff5ed15bce __open + 10

1   avguard.bin                  0x000000010ea77bfd

2   libdyld.dylib                0x00007fff5ebdc0a1 start + 1

3   avguard.bin                  0x0000000000000002

 

Binary Images:

       0x10ea75000 -        0x10ed77fff  avguard.bin (0) <21de6af8-37fa-3677-ade4-0e2df90ba410> /Applications/Avira.app/Contents/guard/avguard.bin

    0x7fff5ebc6000 -     0x7fff5ebf4fff  libdyld.dylib (625.13) <44eff046-f584-3ac2-ac79-0fcc9dcdc419> /usr/lib/system/libdyld.dylib

    0x7fff5ed14000 -     0x7fff5ed3bff7  libsystem_kernel.dylib (4903.201.2) <4999918f-ee77-3e3d-a693-a0645638cc4e> /usr/lib/system/libsystem_kernel.dylib

fehler 21:56:30.539932 +0100 corespotlightd Unsupported type (1) <private>

fehler 21:56:30.540177 +0100 corespotlightd Unsupported type (1) <private>

fehler 21:56:30.545649 +0100 suggestd SGNamedEntityPlugin failed to fetch user activity: Error Domain=NSCocoaErrorDomain Code=4608 "Handoff konnte nicht abgeschlossen werden." UserInfo={NSUnderlyingError=0x7ff1b8d20700 {Error Domain=UAContinuityErrorDomain Code=-107}}

fehler 21:56:30.552902 +0100 cfprefsd rejecting write of key _DKThrottledActivityLast_DKKnowledgeStorageLogging_DKKnowledgeStorageDidInsertEventsNotification:/app/activityActivityDate in { com.apple.coreduetd, root, kCFPreferencesAnyHost, no container, managed: 0 } from process 83 because setting preferences outside an application's container requires user-preference-write or file-write-data sandbox access

fehler 21:56:30.553075 +0100 coreduetd Couldn't write value for key _DKThrottledActivityLast_DKKnowledgeStorageLogging_DKKnowledgeStorageDidInsertEventsNotification:/app/activityActivityDate in CFPrefsPlistSource<0x7faec3f05330> (Domain: com.apple.coreduetd, User: kCFPreferencesCurrentUser, ByHost: No, Container: (null), Contents Need Refresh: No): setting preferences outside an application's container requires user-preference-write or file-write-data sandbox access

fehler 21:56:30.553692 +0100 cfprefsd rejecting write of key _DKThrottledActivityLast_DKKnowledgeStorageLogging_DKKnowledgeStorageDidInsertLocalEventsNotification:/app/activityActivityDate in { com.apple.coreduetd, root, kCFPreferencesAnyHost, no container, managed: 0 } from process 83 because setting preferences outside an application's container requires user-preference-write or file-write-data sandbox access

fehler 21:56:30.553859 +0100 coreduetd Couldn't write value for key _DKThrottledActivityLast_DKKnowledgeStorageLogging_DKKnowledgeStorageDidInsertLocalEventsNotification:/app/activityActivityDate in CFPrefsPlistSource<0x7faec3f05330> (Domain: com.apple.coreduetd, User: kCFPreferencesCurrentUser, ByHost: No, Container: (null), Contents Need Refresh: No): setting preferences outside an application's container requires user-preference-write or file-write-data sandbox access

fehler 21:58:56.138999 +0100 cloudd TIC Read Status [13:0x7fc802d6a470]: 1:57

fehler 21:58:56.139149 +0100 cloudd TIC Read Status [13:0x7fc802d6a470]: 1:57

fehler 21:58:56.139185 +0100 cloudd TIC Read Status [13:0x7fc802d6a470]: 1:57

fehler 21:58:56.145706 +0100 cloudd nw_protocol_boringssl_get_output_frames(1301) <private>[0x7fc80301d1a0] get output frames failed, state 8196

fehler 21:58:56.145821 +0100 cloudd nw_protocol_boringssl_get_output_frames(1301) <private>[0x7fc80301d1a0] get output frames failed, state 8196

fehler 21:58:56.146945 +0100 cloudd TIC Read Status [13:0x0]: 1:57

fehler 21:58:56.146980 +0100 cloudd TIC Read Status [13:0x0]: 1:57

fehler 21:58:56.147052 +0100 cloudd TIC Read Status [13:0x0]: 1:57

fehler 21:58:56.147125 +0100 cloudd TIC Read Status [13:0x0]: 1:57

problem 21:59:17.851429 +0100 quicklookd Failed to generate image with request <private>

fehler 21:59:46.638214 +0100 cfprefsd rejecting read of { com.apple.CoreDuet, severinkampfer, kCFPreferencesAnyHost, no container, managed: 0 } from process 568 because accessing preferences outside an application's container requires user-preference-read or file-read-data sandbox access

fehler 21:59:46.638308 +0100 suggestd Couldn't read values in CFPrefsPlistSource<0x7ff1b8d12e80> (Domain: com.apple.CoreDuet, User: kCFPreferencesCurrentUser, ByHost: No, Container: (null), Contents Need Refresh: Yes): accessing preferences outside an application's container requires user-preference-read or file-read-data sandbox access

fehler 21:59:46.640652 +0100 suggestd error: -addPersistentStoreWithType:SQLite configuration:(null) URL:file:///var/db/CoreDuet/People//interactionC.db options:{

    NSInferMappingModelAutomaticallyOption = 0;

    NSMigratePersistentStoresAutomaticallyOption = 0;

    NSReadOnlyPersistentStoreOption = 1;

} ... returned error Error Domain=NSCocoaErrorDomain Code=256 "Die Datei konnte nicht geöffnet werden." UserInfo={reason=Failed to access file: 1} with userInfo dictionary {

    reason = "Failed to access file: 1";

}

fehler 21:59:46.640906 +0100 suggestd Failed to add persistent stores: Error Domain=NSCocoaErrorDomain Code=256 "Die Datei konnte nicht geöffnet werden." UserInfo={reason=<private>}

fehler 21:59:47.144720 +0100 suggestd error: -addPersistentStoreWithType:SQLite configuration:(null) URL:file:///var/db/CoreDuet/People//interactionC.db options:{

    NSInferMappingModelAutomaticallyOption = 0;

    NSMigratePersistentStoresAutomaticallyOption = 0;

    NSReadOnlyPersistentStoreOption = 1;

} ... returned error Error Domain=NSCocoaErrorDomain Code=256 "Die Datei konnte nicht geöffnet werden." UserInfo={reason=Failed to access file: 1} with userInfo dictionary {

    reason = "Failed to access file: 1";

}

fehler 21:59:47.145449 +0100 suggestd Failed to add persistent stores: Error Domain=NSCocoaErrorDomain Code=256 "Die Datei konnte nicht geöffnet werden." UserInfo={reason=<private>}

problem 22:00:19.157925 +0100 locationd wifi scan failed with error: Error Domain=NSPOSIXErrorDomain Code=16 "Resource busy"

problem 22:00:19.171128 +0100 locationd wifi scan failed with error: Error Domain=NSPOSIXErrorDomain Code=16 "Resource busy"

fehler 22:02:06.067028 +0100 suggestd Error retrieving contacts from daemon: Error Domain=NSCocoaErrorDomain Code=4099 "The connection to service named com.apple.contacts.donation.agent was invalidated." UserInfo={NSDebugDescription=The connection to service named com.apple.contacts.donation.agent was invalidated.}

fehler 22:02:06.101911 +0100 cfprefsd rejecting read of { com.apple.GEO, severinkampfer, kCFPreferencesAnyHost, no container, managed: 0 } from process 568 because accessing preferences outside an application's container requires user-preference-read or file-read-data sandbox access

fehler 22:02:06.102205 +0100 suggestd Couldn't read values in CFPrefsPlistSource<0x7ff1b8f90970> (Domain: com.apple.GEO, User: kCFPreferencesCurrentUser, ByHost: No, Container: (null), Contents Need Refresh: Yes): accessing preferences outside an application's container requires user-preference-read or file-read-data sandbox access

fehler 22:02:06.223936 +0100 com.apple.geod boringssl_session_errorlog(224) <private>[0x7faca4fbc160] [boringssl_session_read] SSL_ERROR_SSL(1): operation failed within the library

fehler 22:02:06.224030 +0100 com.apple.geod boringssl_session_handshake_error_print(205) <private>[0x7faca4fbc160] <private>

fehler 22:02:06.224089 +0100 com.apple.geod boringssl_session_errorlog(224) <private>[0x7faca4fbc160] [boringssl_session_read] SSL_ERROR_SSL(1): operation failed within the library

fehler 22:02:06.224141 +0100 com.apple.geod boringssl_session_handshake_error_print(205) <private>[0x7faca4fbc160] <private>

problem 22:02:48.364773 +0100 quicklookd Failed to generate image with request <private>

fehler 22:04:58.293309 +0100 PowerChime Unable to load Info.plist exceptions (eGPUOverrides)

fehler 22:05:03.592319 +0100 fud get_Apple_primary_power_source No external power adapter details, pCFDictPowerAdapter:NULL

problem 22:05:17.521699 +0100 quicklookd Failed to generate image with request <private>

fehler 22:05:42.519382 +0100 rtcreportingd nw_parameters_set_source_application_by_bundle_id Failed to convert from bundle ID (com.apple.system.diagnostics) to UUID. This could lead to wrong data usage accounting.

fehler 22:05:42.548185 +0100 rtcreportingd nw_parameters_set_source_application_by_bundle_id Failed to convert from bundle ID (com.apple.system.diagnostics) to UUID. This could lead to wrong data usage accounting.

fehler 22:05:42.570228 +0100 rtcreportingd nw_endpoint_flow_validate_delegation [C1.1 IPv4#9b768af3:443 in_progress socket-flow (satisfied)] Network Delegation Failure: Invalid Bundle ID "com.apple.system.diagnostics" [M]

fehler 22:05:42.586730 +0100 rtcreportingd nw_endpoint_flow_validate_delegation [C2.1 IPv4#56d0bfcb:443 in_progress socket-flow (satisfied)] Network Delegation Failure: Invalid Bundle ID "com.apple.system.diagnostics" [M]

fehler 22:05:42.721764 +0100 rtcreportingd boringssl_session_errorlog(224) <private>[0x7fc595c17170] [boringssl_session_read] SSL_ERROR_SSL(1): operation failed within the library

fehler 22:05:42.721835 +0100 rtcreportingd boringssl_session_handshake_error_print(205) <private>[0x7fc595c17170] <private>

fehler 22:05:42.721918 +0100 rtcreportingd boringssl_session_errorlog(224) <private>[0x7fc595c17170] [boringssl_session_read] SSL_ERROR_SSL(1): operation failed within the library

fehler 22:05:42.721971 +0100 rtcreportingd boringssl_session_handshake_error_print(205) <private>[0x7fc595c17170] <private>

fehler 22:05:42.727036 +0100 rtcreportingd boringssl_session_errorlog(224) <private>[0x7fc595c17170] [boringssl_session_read] SSL_ERROR_SSL(1): operation failed within the library

fehler 22:05:42.727071 +0100 rtcreportingd boringssl_session_handshake_error_print(205) <private>[0x7fc595c17170] <private>

fehler 22:05:42.727108 +0100 rtcreportingd boringssl_session_errorlog(224) <private>[0x7fc595c17170] [boringssl_session_read] SSL_ERROR_SSL(1): operation failed within the library

fehler 22:05:42.727186 +0100 rtcreportingd boringssl_session_handshake_error_print(205) <private>[0x7fc595c17170] <private>

fehler 22:05:43.230025 +0100 rtcreportingd boringssl_session_errorlog(224) <private>[0x7fc595c1bcc0] [boringssl_session_read] SSL_ERROR_SSL(1): operation failed within the library

fehler 22:05:43.230083 +0100 rtcreportingd boringssl_session_handshake_error_print(205) <private>[0x7fc595c1bcc0] <private>

fehler 22:05:43.230145 +0100 rtcreportingd boringssl_session_errorlog(224) <private>[0x7fc595c1bcc0] [boringssl_session_read] SSL_ERROR_SSL(1): operation failed within the library

fehler 22:05:43.230201 +0100 rtcreportingd boringssl_session_handshake_error_print(205) <private>[0x7fc595c1bcc0] <private>

fehler 22:05:43.231344 +0100 rtcreportingd boringssl_session_errorlog(224) <private>[0x7fc595c1bcc0] [boringssl_session_read] SSL_ERROR_SSL(1): operation failed within the library

fehler 22:05:43.231408 +0100 rtcreportingd boringssl_session_handshake_error_print(205) <private>[0x7fc595c1bcc0] <private>

fehler 22:05:43.231494 +0100 rtcreportingd boringssl_session_errorlog(224) <private>[0x7fc595c1bcc0] [boringssl_session_read] SSL_ERROR_SSL(1): operation failed within the library

fehler 22:05:43.231548 +0100 rtcreportingd boringssl_session_handshake_error_print(205) <private>[0x7fc595c1bcc0] <private>

fehler 22:08:04.343725 +0100 AppleSpell ==== XPC handleXPCMessage XPC_ERROR_CONNECTION_INVALID

fehler 22:08:04.388801 +0100 AppleSpell ==== XPC handleXPCMessage XPC_ERROR_CONNECTION_INVALID

fehler 22:08:18.990410 +0100 TouchBarServer DFRDisplayHandlePacket status:e00002c7 packet:<private> length:16

fehler 22:09:29.112863 +0100 corebrightnessd -[CBColorModule updateActivity]: whitepoint adjustment are not available (CoreDisplay is down)

fehler 22:09:29.112320 +0100 TouchBarServer DFRDisplayHandlePacket status:e00002c7 packet:<private> length:16

fehler 22:09:29.160087 +0100 TouchBarServer DFRDisplayHandlePacket status:e00002c7 packet:<private> length:16

problem 22:09:29.514126 +0100 quicklookd Failed to generate image with request <private>

fehler 22:09:29.601285 +0100 assistantd -[ADCommandCenter assistantSessionManager:receivedError:isRetryableError:] Error Domain=kAFAssistantErrorDomain Code=33 "(null)"

fehler 22:09:29.601506 +0100 assistantd -[ADCommandCenter _completeRequestForCurrentDelegate:error:] success = 0, error = Error Domain=kAFAssistantErrorDomain Code=33

fehler 22:09:29.932407 +0100 loginwindow Failed to set up CFPasteboardRef 'AppleInputSourcesInUIOrderPasteboard'. Error: <error: 0x7fff91bea140> { count = 1, transaction: 0, voucher = 0x0, contents =

"XPCErrorDescription" => <string: 0x7fff91bea3e8> { length = 18, contents = "Connection invalid" }

}

fehler 22:09:29.932500 +0100 loginwindow Failed to set up CFPasteboardRef 'AppleInputSourcesInUIOrderPasteboard'. Error: <error: 0x7fff91bea140> { count = 1, transaction: 0, voucher = 0x0, contents =

"XPCErrorDescription" => <string: 0x7fff91bea3e8> { length = 18, contents = "Connection invalid" }

}

fehler 22:09:29.932814 +0100 loginwindow Failed to set up CFPasteboardRef 'AppleIntlFileCacheModificationDatePasteboard'. Error: <error: 0x7fff91bea140> { count = 1, transaction: 0, voucher = 0x0, contents =

"XPCErrorDescription" => <string: 0x7fff91bea3e8> { length = 18, contents = "Connection invalid" }

}

fehler 22:09:30.110428 +0100 loginwindow Failed to set up CFPasteboardRef 'AppleIntlFileCacheModificationDatePasteboard'. Error: <error: 0x7fff91bea140> { count = 1, transaction: 0, voucher = 0x0, contents =

"XPCErrorDescription" => <string: 0x7fff91bea3e8> { length = 18, contents = "Connection invalid" }

}

fehler 22:09:30.110529 +0100 loginwindow Failed to set up CFPasteboardRef 'AppleIntlFileCacheModificationDatePasteboard'. Error: <error: 0x7fff91bea140> { count = 1, transaction: 0, voucher = 0x0, contents =

"XPCErrorDescription" => <string: 0x7fff91bea3e8> { length = 18, contents = "Connection invalid" }

}

fehler 22:09:30.110930 +0100 loginwindow Failed to set up CFPasteboardRef 'AppleIntlFileCacheModificationDatePasteboard'. Error: <error: 0x7fff91bea140> { count = 1, transaction: 0, voucher = 0x0, contents =

"XPCErrorDescription" => <string: 0x7fff91bea3e8> { length = 18, contents = "Connection invalid" }

}

fehler 22:09:30.111030 +0100 loginwindow Failed to set up CFPasteboardRef 'AppleIntlFileCacheModificationDatePasteboard'. Error: <error: 0x7fff91bea140> { count = 1, transaction: 0, voucher = 0x0, contents =

"XPCErrorDescription" => <string: 0x7fff91bea3e8> { length = 18, contents = "Connection invalid" }

}

fehler 22:09:30.111181 +0100 loginwindow Failed to set up CFPasteboardRef 'AppleIntlFileCacheModificationDatePasteboard'. Error: <error: 0x7fff91bea140> { count = 1, transaction: 0, voucher = 0x0, contents =

"XPCErrorDescription" => <string: 0x7fff91bea3e8> { length = 18, contents = "Connection invalid" }

}

fehler 22:09:30.111267 +0100 loginwindow Failed to set up CFPasteboardRef 'AppleIntlFileCacheModificationDatePasteboard'. Error: <error: 0x7fff91bea140> { count = 1, transaction: 0, voucher = 0x0, contents =

"XPCErrorDescription" => <string: 0x7fff91bea3e8> { length = 18, contents = "Connection invalid" }

}

fehler 22:09:30.111579 +0100 loginwindow Failed to set up CFPasteboardRef 'AppleIntlFileCacheModificationDatePasteboard'. Error: <error: 0x7fff91bea140> { count = 1, transaction: 0, voucher = 0x0, contents =

"XPCErrorDescription" => <string: 0x7fff91bea3e8> { length = 18, contents = "Connection invalid" }

}

fehler 22:09:30.111739 +0100 loginwindow Failed to set up CFPasteboardRef 'AppleIntlFileCacheModificationDatePasteboard'. Error: <error: 0x7fff91bea140> { count = 1, transaction: 0, voucher = 0x0, contents =

"XPCErrorDescription" => <string: 0x7fff91bea3e8> { length = 18, contents = "Connection invalid" }

}

fehler 22:09:30.112239 +0100 loginwindow Failed to set up CFPasteboardRef 'AppleIntlFileCacheModificationDatePasteboard'. Error: <error: 0x7fff91bea140> { count = 1, transaction: 0, voucher = 0x0, contents =

"XPCErrorDescription" => <string: 0x7fff91bea3e8> { length = 18, contents = "Connection invalid" }

}

fehler 22:09:30.112344 +0100 loginwindow Failed to set up CFPasteboardRef 'AppleIntlFileCacheModificationDatePasteboard'. Error: <error: 0x7fff91bea140> { count = 1, transaction: 0, voucher = 0x0, contents =

"XPCErrorDescription" => <string: 0x7fff91bea3e8> { length = 18, contents = "Connection invalid" }

}

fehler 22:09:30.112605 +0100 loginwindow Failed to set up CFPasteboardRef 'AppleIntlFileCacheModificationDatePasteboard'. Error: <error: 0x7fff91bea140> { count = 1, transaction: 0, voucher = 0x0, contents =

"XPCErrorDescription" => <string: 0x7fff91bea3e8> { length = 18, contents = "Connection invalid" }

}

fehler 22:09:30.112769 +0100 loginwindow Failed to set up CFPasteboardRef 'AppleIntlFileCacheModificationDatePasteboard'. Error: <error: 0x7fff91bea140> { count = 1, transaction: 0, voucher = 0x0, contents =

"XPCErrorDescription" => <string: 0x7fff91bea3e8> { length = 18, contents = "Connection invalid" }

}

fehler 22:09:30.113252 +0100 loginwindow Failed to set up CFPasteboardRef 'AppleIntlFileCacheModificationDatePasteboard'. Error: <error: 0x7fff91bea140> { count = 1, transaction: 0, voucher = 0x0, contents =

"XPCErrorDescription" => <string: 0x7fff91bea3e8> { length = 18, contents = "Connection invalid" }

}

fehler 22:09:30.113344 +0100 loginwindow Failed to set up CFPasteboardRef 'AppleIntlFileCacheModificationDatePasteboard'. Error: <error: 0x7fff91bea140> { count = 1, transaction: 0, voucher = 0x0, contents =

"XPCErrorDescription" => <string: 0x7fff91bea3e8> { length = 18, contents = "Connection invalid" }

}

fehler 22:09:30.113493 +0100 loginwindow Failed to set up CFPasteboardRef 'AppleIntlFileCacheModificationDatePasteboard'. Error: <error: 0x7fff91bea140> { count = 1, transaction: 0, voucher = 0x0, contents =

"XPCErrorDescription" => <string: 0x7fff91bea3e8> { length = 18, contents = "Connection invalid" }

}

fehler 22:09:30.160158 +0100 kernel loginwindow is not entitled for IOHIDLibUserClient keyboard access

fehler 22:09:30.160316 +0100 kernel loginwindow is not entitled for IOHIDLibUserClient keyboard access

fehler 22:09:30.193975 +0100 kernel loginwindow is not entitled for IOHIDLibUserClient keyboard access

fehler 22:09:30.193975 +0100 kernel loginwindow is not entitled for IOHIDLibUserClient keyboard access

fehler 22:09:30.268857 +0100 loginwindow <private>

fehler 22:09:30.521890 +0100 timed Command 'TMSetAuthenticatedSourceTime' included mach time when not expected, forcing conversion

fehler 22:09:30.540928 +0100 loginwindow Failed to set up CFPasteboardRef 'ApplePerContextInputPasteboard'. Error: <error: 0x7fff91bea140> { count = 1, transaction: 0, voucher = 0x0, contents =

"XPCErrorDescription" => <string: 0x7fff91bea3e8> { length = 18, contents = "Connection invalid" }

}

fehler 22:09:30.541458 +0100 loginwindow Failed to set up CFPasteboardRef 'ApplePerContextInputPasteboard'. Error: <error: 0x7fff91bea140> { count = 1, transaction: 0, voucher = 0x0, contents =

"XPCErrorDescription" => <string: 0x7fff91bea3e8> { length = 18, contents = "Connection invalid" }

}

fehler 22:09:30.576381 +0100 timed Command 'TMSetAuthenticatedSourceTime' included mach time when not expected, forcing conversion

fehler 22:09:31.522391 +0100 apsd <APSPreferences: 0x7fcc1b400700>: Preferences may have changed, checking for any relevant changes

fehler 22:09:35.562772 +0100 opendirectoryd Authentication failed for <private> with ODErrorCredentialsInvalid

fehler 22:09:44.178614 +0100 wirelessproxd CoreBluetooth isn't advertising for this client type

fehler 22:09:44.188914 +0100 bluetoothd Unpublish - PSM:129 Client:<CBClient: 0x7f829ce043e0>

fehler 22:09:44.188956 +0100 bluetoothd Unpublish - Success

fehler 22:09:44.189353 +0100 TouchBarServer DFRDisplayHandlePacket status:e00002c7 packet:<private> length:16

fehler 22:09:44.189114 +0100 bluetoothd Removing Client

fehler 22:09:44.192992 +0100 bluetoothd No Devices In Whitelist

fehler 22:09:44.194002 +0100 rapportd XPC connection invalid

fehler 22:09:42.124392 +0100 eosd [iBridge]: recv() failed, reason: <private>

fehler 22:09:42.125756 +0100 eosd [iBridge]: could not read incoming header's length

fehler 22:09:45.287210 +0100 timed Command 'TMSetAuthenticatedSourceTime' included mach time when not expected, forcing conversion

fehler 22:09:45.491726 +0100 opendirectoryd Authentication failed for <private> with ODErrorCredentialsInvalid

fehler 22:10:03.117273 +0100 kernel AssertMacros: _state == smActive (value = 0x0),  file: /BuildRoot/Library/Caches/com.apple.xbs/Sources/KernelRelay/KernelRelay-54.200.1/IOSlaveProcessorRelay/IOSlaveProcessorRelay.cpp, line: 846

fehler 22:10:03.117286 +0100 kernel AssertMacros: cmd (value = 0x0),  file: /BuildRoot/Library/Caches/com.apple.xbs/Sources/KernelRelay/KernelRelay-54.200.1/IOSlaveProcessorRelay/IOSlaveProcessorRelay.cpp, line: 1549

fehler 22:12:35.094097 +0100 corebrightnessd -[CBColorModule updateActivity]: whitepoint adjustment are not available (CoreDisplay is down)

fehler 22:12:35.098928 +0100 SystemUIServer hotkey 181 is enabled: 1

fehler 22:12:35.099080 +0100 SystemUIServer hotkey 182 is enabled: 1

fehler 22:12:35.155222 +0100 eoshostd connect(sockfd: 3, ...) failed, reason: No route to host, will retry 4 times

fehler 22:12:35.158607 +0100 eoshostd connect(sockfd: 3, ...) failed, reason: No route to host, will retry 3 times

fehler 22:12:35.161750 +0100 eoshostd connect(sockfd: 3, ...) failed, reason: No route to host, will retry 2 times

fehler 22:12:35.164559 +0100 eoshostd connect(sockfd: 3, ...) failed, reason: No route to host, will retry 1 times

fehler 22:12:35.167621 +0100 eoshostd connect() failed, reason: No route to host, giving up

fehler 22:12:35.167699 +0100 eoshostd eos_device_connect() failed, service=9 err=0x7(kEOSErrorUnknown) connect err=0x41(No route to host)

fehler 22:12:35.167944 +0100 eoshostd connect(sockfd: 3, ...) failed, reason: No route to host, will retry 4 times

fehler 22:12:35.168055 +0100 eoshostd connect(sockfd: 3, ...) failed, reason: No route to host, will retry 3 times

fehler 22:12:35.168423 +0100 eoshostd connect(sockfd: 3, ...) failed, reason: No route to host, will retry 2 times

fehler 22:12:35.169135 +0100 eoshostd connect(sockfd: 3, ...) failed, reason: No route to host, will retry 1 times

fehler 22:12:35.169949 +0100 eoshostd connect() failed, reason: No route to host, giving up

fehler 22:12:35.170059 +0100 eoshostd eos_device_connect() failed, service=9 err=0x7(kEOSErrorUnknown) connect err=0x41(No route to host)

fehler 22:12:35.100990 +0100 kernel AssertMacros: _state == smActive (value = 0x0),  file: /BuildRoot/Library/Caches/com.apple.xbs/Sources/KernelRelay/KernelRelay-54.200.1/IOSlaveProcessorRelay/IOSlaveProcessorRelay.cpp, line: 846

fehler 22:12:35.100995 +0100 kernel AssertMacros: cmd (value = 0x0),  file: /BuildRoot/Library/Caches/com.apple.xbs/Sources/KernelRelay/KernelRelay-54.200.1/IOSlaveProcessorRelay/IOSlaveProcessorRelay.cpp, line: 1515

fehler 22:12:35.306114 +0100 bluetoothd Publish - PSM:129 Client:<CBClient: 0x7f829ce2ae00> Encryption:0 Options:{

}

fehler 22:12:35.490849 +0100 loginwindow Failed to set up CFPasteboardRef 'ApplePerContextInputPasteboard'. Error: <error: 0x7fff91bea140> { count = 1, transaction: 0, voucher = 0x0, contents =

"XPCErrorDescription" => <string: 0x7fff91bea3e8> { length = 18, contents = "Connection invalid" }

}

fehler 22:12:35.491009 +0100 loginwindow Failed to set up CFPasteboardRef 'ApplePerContextInputPasteboard'. Error: <error: 0x7fff91bea140> { count = 1, transaction: 0, voucher = 0x0, contents =

"XPCErrorDescription" => <string: 0x7fff91bea3e8> { length = 18, contents = "Connection invalid" }

}

fehler 22:12:35.510996 +0100 CommCenter Pid: <private> is NOT VALID. Cannot get value from carrier bundle for key E911OverITechSupported

fehler 22:12:35.529132 +0100 cfprefsd rejecting read of { kCFPreferencesAnyApplication, severinkampfer, kCFPreferencesAnyHost, no container, managed: 0 } from process 393 because accessing preferences outside an application's container requires user-preference-read or file-read-data sandbox access

fehler 22:12:35.529342 +0100 callservicesd Couldn't read values in CFPrefsPlistSource<0x7fd7f2603dd0> (Domain: kCFPreferencesAnyApplication, User: kCFPreferencesCurrentUser, ByHost: No, Container: (null), Contents Need Refresh: Yes): accessing preferences outside an application's container requires user-preference-read or file-read-data sandbox access

fehler 22:12:35.609612 +0100 loginwindow Failed to set up CFPasteboardRef 'ApplePerContextInputPasteboard'. Error: <error: 0x7fff91bea140> { count = 1, transaction: 0, voucher = 0x0, contents =

"XPCErrorDescription" => <string: 0x7fff91bea3e8> { length = 18, contents = "Connection invalid" }

}

fehler 22:12:35.609788 +0100 loginwindow Failed to set up CFPasteboardRef 'ApplePerContextInputPasteboard'. Error: <error: 0x7fff91bea140> { count = 1, transaction: 0, voucher = 0x0, contents =

"XPCErrorDescription" => <string: 0x7fff91bea3e8> { length = 18, contents = "Connection invalid" }

}

fehler 22:12:36.721507 +0100 CalendarAgent TIC TCP Conn Failed [4:0x7fbcd0c651e0]: 1:50 Err(50)

fehler 22:12:36.722796 +0100 CalendarAgent Task <0F9A2C3E-1309-41D5-B091-9824574DFDE8>.<0> HTTP load failed (error code: -1009 [1:50])

fehler 22:12:36.722893 +0100 CalendarAgent NSURLConnection finished with error - code -1009

fehler 22:12:36.927693 +0100 CalendarAgent TIC TCP Conn Failed [5:0x7fbcd09b5890]: 1:50 Err(50)

fehler 22:12:36.928769 +0100 CalendarAgent Task <31E423B2-52F2-4BA1-BC8A-C7F513FE5754>.<0> HTTP load failed (error code: -1009 [1:50])

fehler 22:12:36.928827 +0100 CalendarAgent NSURLConnection finished with error - code -1009

fehler 22:12:36.965941 +0100 CalendarAgent TIC TCP Conn Failed [6:0x7fbcd09b5890]: 1:50 Err(50)

fehler 22:12:36.967005 +0100 CalendarAgent Task <96AE2BBB-999F-40AD-A2D2-25E6ADB8E5CF>.<0> HTTP load failed (error code: -1009 [1:50])

fehler 22:12:36.967060 +0100 CalendarAgent NSURLConnection finished with error - code -1009

fehler 22:12:36.979128 +0100 CalendarAgent TIC TCP Conn Failed [7:0x7fbcd0b763c0]: 1:50 Err(50)

fehler 22:12:36.980027 +0100 CalendarAgent Task <563B0DA4-2A01-45E8-B028-CE530A5F19CE>.<0> HTTP load failed (error code: -1009 [1:50])

fehler 22:12:36.980082 +0100 CalendarAgent NSURLConnection finished with error - code -1009

fehler 22:12:36.986185 +0100 CalendarAgent TIC TCP Conn Failed [8:0x7fbcd0f11f40]: 1:50 Err(50)

fehler 22:12:36.987426 +0100 CalendarAgent Task <9474D729-6F30-4079-9666-594A1949D96D>.<0> HTTP load failed (error code: -1009 [1:50])

fehler 22:12:36.987552 +0100 CalendarAgent NSURLConnection finished with error - code -1009

fehler 22:12:36.993338 +0100 CalendarAgent TIC TCP Conn Failed [9:0x7fbcce5f0d70]: 1:50 Err(50)

fehler 22:12:36.994234 +0100 CalendarAgent Task <BA6CBF32-A6F7-452A-AEB8-36F001D353BD>.<0> HTTP load failed (error code: -1009 [1:50])

fehler 22:12:36.994288 +0100 CalendarAgent NSURLConnection finished with error - code -1009

fehler 22:12:37.026576 +0100 NotificationCenter We transitioned in an unexpected way from screen off to login window without going to the notification shield.

fehler 22:12:37.731008 +0100 apsd TIC TCP Conn Failed [4:0x7fcc1b7332d0]: 1:50 Err(50)

fehler 22:12:37.736004 +0100 apsd Task <432602D0-F3CE-4046-84CD-5B4121F528E5>.<0> HTTP load failed (error code: -1009 [1:50])

fehler 22:12:37.736105 +0100 apsd NSURLConnection finished with error - code -1009

fehler 22:12:37.743615 +0100 apsd nw_connection_get_connected_socket [C5] Client called nw_connection_get_connected_socket on unconnected nw_connection

fehler 22:12:37.743770 +0100 apsd TCP Conn 0x7fcc1b432fa0 Failed : error 0:50 [50]

fehler 22:12:37.759183 +0100 apsd TIC TCP Conn Failed [6:0x7fcc1b63ca70]: 1:50 Err(50)

fehler 22:12:37.762689 +0100 apsd Task <2A7DAFD1-5310-416D-81E8-BA39B6751D12>.<0> HTTP load failed (error code: -1009 [1:50])

fehler 22:12:37.762742 +0100 apsd NSURLConnection finished with error - code -1009

fehler 22:12:37.765391 +0100 apsd nw_connection_get_connected_socket [C7] Client called nw_connection_get_connected_socket on unconnected nw_connection

fehler 22:12:37.765442 +0100 apsd TCP Conn 0x7fcc1b656b00 Failed : error 0:50 [50]

fehler 22:12:38.520186 +0100 opendirectoryd Authentication failed for <private> with ODErrorCredentialsInvalid

fehler 22:12:38.590903 +0100 apsd TIC TCP Conn Failed [8:0x7fcc1b432fa0]: 1:50 Err(50)

fehler 22:12:38.592386 +0100 apsd Task <1C7F398B-815F-4C16-B215-74CA5B164BF0>.<0> HTTP load failed (error code: -1009 [1:50])

fehler 22:12:38.592456 +0100 apsd NSURLConnection finished with error - code -1009

fehler 22:12:38.597787 +0100 apsd nw_connection_get_connected_socket [C9] Client called nw_connection_get_connected_socket on unconnected nw_connection

fehler 22:12:38.597972 +0100 apsd TCP Conn 0x7fcc1b432fa0 Failed : error 0:50 [50]

fehler 22:12:38.617922 +0100 apsd TIC TCP Conn Failed [10:0x7fcc1b6481f0]: 1:50 Err(50)

fehler 22:12:38.622590 +0100 apsd Task <17A83ECA-F0EC-4730-9C84-2238D0364E52>.<0> HTTP load failed (error code: -1009 [1:50])

fehler 22:12:38.622728 +0100 apsd NSURLConnection finished with error - code -1009

fehler 22:12:38.626539 +0100 apsd nw_connection_get_connected_socket [C11] Client called nw_connection_get_connected_socket on unconnected nw_connection

fehler 22:12:38.626670 +0100 apsd TCP Conn 0x7fcc1b724fa0 Failed : error 0:50 [50]

fehler 22:12:41.328377 +0100 apsd <APSPreferences: 0x7fcc1b400700>: Preferences may have changed, checking for any relevant changes

fehler 22:12:41.649362 +0100 apsd TIC TCP Conn Failed [12:0x7fcc1b528480]: 1:50 Err(50)

fehler 22:12:41.650773 +0100 apsd Task <8CA19A24-7B81-41D2-8858-07E61F30A860>.<0> HTTP load failed (error code: -1009 [1:50])

fehler 22:12:41.650854 +0100 apsd NSURLConnection finished with error - code -1009

fehler 22:12:41.665160 +0100 apsd nw_connection_get_connected_socket [C13] Client called nw_connection_get_connected_socket on unconnected nw_connection

fehler 22:12:41.665268 +0100 apsd TCP Conn 0x7fcc1b402c00 Failed : error 0:50 [50]

fehler 22:12:41.693668 +0100 apsd TIC TCP Conn Failed [14:0x7fcc1b70f150]: 1:50 Err(50)

fehler 22:12:41.695665 +0100 apsd Task <29C7A7B0-44B3-469B-BF8E-CDA065B65CCF>.<0> HTTP load failed (error code: -1009 [1:50])

fehler 22:12:41.696289 +0100 apsd NSURLConnection finished with error - code -1009

fehler 22:12:41.700768 +0100 apsd nw_connection_get_connected_socket [C15] Client called nw_connection_get_connected_socket on unconnected nw_connection

fehler 22:12:41.701145 +0100 apsd TCP Conn 0x7fcc1b44c2d0 Failed : error 0:50 [50]

fehler 22:12:44.529976 +0100 CommCenter Pid: <private> is NOT VALID. Cannot get value from carrier bundle for key E911OverITechSupported

fehler 22:12:44.530082 +0100 CommCenter Pid: <private> is NOT VALID. Cannot get value from carrier bundle for key E911OverITechSupported

fehler 22:12:44.530634 +0100 CommCenter Pid: <private> is NOT VALID. Cannot get value from carrier bundle for key E911OverITechNoLimit

fehler 22:12:44.530959 +0100 CommCenter Pid: <private> is NOT VALID. Cannot get value from carrier bundle for key E911OverITechSupported

fehler 22:12:44.531036 +0100 CommCenter Pid: <private> is NOT VALID. Cannot get value from carrier bundle for key E911OverITechSupported

fehler 22:12:44.531178 +0100 CommCenter Pid: <private> is NOT VALID. Cannot get value from carrier bundle for key E911OverITechNoLimit

fehler 22:12:44.689347 +0100 IMRemoteURLConnectionAgent Denying xpc connection, task does not have entitlement: com.apple.private.imcore.imremoteurlconnection  (callservicesd:393)

fehler 22:12:44.720566 +0100 IMRemoteURLConnectionAgent Denying xpc connection, task does not have entitlement: com.apple.private.imcore.imremoteurlconnection  (callservicesd:393)

fehler 22:12:44.749901 +0100 callservicesd Remote loader crashed for request: <NSMutableURLRequest: 0x7fd7f2700370> { URL: http://init.ess.apple.com/WebObjects/VCInit.woa/wa/getBag?ix=4 }

fehler 22:12:44.749951 +0100 callservicesd => Retrying... (0/5) retries

fehler 22:12:44.757675 +0100 IMRemoteURLConnectionAgent Denying xpc connection, task does not have entitlement: com.apple.private.imcore.imremoteurlconnection  (callservicesd:393)

fehler 22:12:44.758479 +0100 IMRemoteURLConnectionAgent Denying xpc connection, task does not have entitlement: com.apple.private.imcore.imremoteurlconnection  (callservicesd:393)

fehler 22:12:44.768106 +0100 IMRemoteURLConnectionAgent Denying xpc connection, task does not have entitlement: com.apple.private.imcore.imremoteurlconnection  (callservicesd:393)

fehler 22:12:44.769332 +0100 IMRemoteURLConnectionAgent Denying xpc connection, task does not have entitlement: com.apple.private.imcore.imremoteurlconnection  (callservicesd:393)

fehler 22:12:44.798455 +0100 callservicesd Remote loader crashed for request: <NSMutableURLRequest: 0x7fd7f252af40> { URL: http://init-p01md.apple.com/bag }

fehler 22:12:44.798505 +0100 callservicesd => Retrying... (0/5) retries

fehler 22:12:44.798785 +0100 callservicesd Remote loader crashed for request: <NSMutableURLRequest: 0x7fd7f2700370> { URL: http://init.ess.apple.com/WebObjects/VCInit.woa/wa/getBag?ix=4 }

fehler 22:12:44.798878 +0100 callservicesd => Retrying... (1/5) retries

fehler 22:12:44.801484 +0100 IMRemoteURLConnectionAgent Denying xpc connection, task does not have entitlement: com.apple.private.imcore.imremoteurlconnection  (callservicesd:393)

fehler 22:12:44.801761 +0100 callservicesd Remote loader crashed for request: <NSMutableURLRequest: 0x7fd7f252af40> { URL: http://init-p01md.apple.com/bag }

fehler 22:12:44.802051 +0100 IMRemoteURLConnectionAgent Denying xpc connection, task does not have entitlement: com.apple.private.imcore.imremoteurlconnection  (callservicesd:393)

fehler 22:12:44.801833 +0100 callservicesd => Retrying... (1/5) retries

fehler 22:12:46.997937 +0100 IMRemoteURLConnectionAgent Denying xpc connection, task does not have entitlement: com.apple.private.imcore.imremoteurlconnection  (callservicesd:393)

fehler 22:12:46.998286 +0100 callservicesd Remote loader crashed for request: <NSMutableURLRequest: 0x7fd7f2700370> { URL: http://init.ess.apple.com/WebObjects/VCInit.woa/wa/getBag?ix=4 }

fehler 22:12:46.998462 +0100 IMRemoteURLConnectionAgent Denying xpc connection, task does not have entitlement: com.apple.private.imcore.imremoteurlconnection  (callservicesd:393)

fehler 22:12:46.998432 +0100 callservicesd => Retrying... (2/5) retries

fehler 22:12:46.998951 +0100 IMRemoteURLConnectionAgent Denying xpc connection, task does not have entitlement: com.apple.private.imcore.imremoteurlconnection  (callservicesd:393)

fehler 22:12:46.999130 +0100 callservicesd Remote loader crashed for request: <NSMutableURLRequest: 0x7fd7f252af40> { URL: http://init-p01md.apple.com/bag }

fehler 22:12:46.999334 +0100 IMRemoteURLConnectionAgent Denying xpc connection, task does not have entitlement: com.apple.private.imcore.imremoteurlconnection  (callservicesd:393)

fehler 22:12:46.999279 +0100 callservicesd => Retrying... (2/5) retries

fehler 22:12:47.716261 +0100 symptomsd failed to start ticker tickerFatal, not active, active probe: 0x0

fehler 22:12:50.298824 +0100 Adobe Desktop Service boringssl_session_errorlog(224) <private>[0x7f9aafd83370] [boringssl_session_read] SSL_ERROR_SSL(1): operation failed within the library

fehler 22:12:50.298857 +0100 Adobe Desktop Service boringssl_session_handshake_error_print(205) <private>[0x7f9aafd83370] <private>

fehler 22:12:50.298893 +0100 Adobe Desktop Service boringssl_session_errorlog(224) <private>[0x7f9aafd83370] [boringssl_session_read] SSL_ERROR_SSL(1): operation failed within the library

fehler 22:12:50.298924 +0100 Adobe Desktop Service boringssl_session_handshake_error_print(205) <private>[0x7f9aafd83370] <private>

fehler 22:12:50.300149 +0100 Adobe Desktop Service boringssl_session_errorlog(224) <private>[0x7f9aafd83370] [boringssl_session_read] SSL_ERROR_SSL(1): operation failed within the library

fehler 22:12:50.300189 +0100 Adobe Desktop Service boringssl_session_handshake_error_print(205) <private>[0x7f9aafd83370] <private>

fehler 22:12:50.300229 +0100 Adobe Desktop Service boringssl_session_errorlog(224) <private>[0x7f9aafd83370] [boringssl_session_read] SSL_ERROR_SSL(1): operation failed within the library

fehler 22:12:50.300262 +0100 Adobe Desktop Service boringssl_session_handshake_error_print(205) <private>[0x7f9aafd83370] <private>

fehler 22:12:51.761467 +0100 CalendarAgent boringssl_session_errorlog(224) <private>[0x7fbcd0f155f0] [boringssl_session_read] SSL_ERROR_SSL(1): operation failed within the library

fehler 22:12:51.761635 +0100 CalendarAgent boringssl_session_handshake_error_print(205) <private>[0x7fbcd0f155f0] <private>

fehler 22:12:51.761713 +0100 CalendarAgent boringssl_session_errorlog(224) <private>[0x7fbcd0f155f0] [boringssl_session_read] SSL_ERROR_SSL(1): operation failed within the library

fehler 22:12:51.761792 +0100 CalendarAgent boringssl_session_handshake_error_print(205) <private>[0x7fbcd0f155f0] <private>

fehler 22:12:51.763131 +0100 CalendarAgent boringssl_session_errorlog(224) <private>[0x7fbcd0f155f0] [boringssl_session_read] SSL_ERROR_SSL(1): operation failed within the library

fehler 22:12:51.763211 +0100 CalendarAgent boringssl_session_handshake_error_print(205) <private>[0x7fbcd0f155f0] <private>

fehler 22:12:51.763280 +0100 CalendarAgent boringssl_session_errorlog(224) <private>[0x7fbcd0f155f0] [boringssl_session_read] SSL_ERROR_SSL(1): operation failed within the library

fehler 22:12:51.763354 +0100 CalendarAgent boringssl_session_handshake_error_print(205) <private>[0x7fbcd0f155f0] <private>

fehler 22:12:51.765658 +0100 CalendarAgent boringssl_session_errorlog(224) <private>[0x7fbcd1246e70] [boringssl_session_read] SSL_ERROR_SSL(1): operation failed within the library

fehler 22:12:51.765749 +0100 CalendarAgent boringssl_session_handshake_error_print(205) <private>[0x7fbcd1246e70] <private>

fehler 22:12:51.765829 +0100 CalendarAgent boringssl_session_errorlog(224) <private>[0x7fbcd1246e70] [boringssl_session_read] SSL_ERROR_SSL(1): operation failed within the library

fehler 22:12:51.765911 +0100 CalendarAgent boringssl_session_handshake_error_print(205) <private>[0x7fbcd1246e70] <private>

fehler 22:12:51.766952 +0100 CalendarAgent boringssl_session_errorlog(224) <private>[0x7fbcd1246e70] [boringssl_session_read] SSL_ERROR_SSL(1): operation failed within the library

fehler 22:12:51.767029 +0100 CalendarAgent boringssl_session_handshake_error_print(205) <private>[0x7fbcd1246e70] <private>

fehler 22:12:51.767096 +0100 CalendarAgent boringssl_session_errorlog(224) <private>[0x7fbcd1246e70] [boringssl_session_read] SSL_ERROR_SSL(1): operation failed within the library

fehler 22:12:51.767172 +0100 CalendarAgent boringssl_session_handshake_error_print(205) <private>[0x7fbcd1246e70] <private>

fehler 22:12:52.000052 +0100 com.apple.geod boringssl_session_errorlog(224) <private>[0x7faca7009330] [boringssl_session_read] SSL_ERROR_SSL(1): operation failed within the library

fehler 22:12:52.000183 +0100 com.apple.geod boringssl_session_handshake_error_print(205) <private>[0x7faca7009330] <private>

fehler 22:12:52.000256 +0100 com.apple.geod boringssl_session_errorlog(224) <private>[0x7faca7009330] [boringssl_session_read] SSL_ERROR_SSL(1): operation failed within the library

fehler 22:12:52.000312 +0100 com.apple.geod boringssl_session_handshake_error_print(205) <private>[0x7faca7009330] <private>

fehler 22:12:52.000633 +0100 com.apple.geod boringssl_session_errorlog(224) <private>[0x7fdf854917c0] [boringssl_session_read] SSL_ERROR_SSL(1): operation failed within the library

fehler 22:12:52.000687 +0100 com.apple.geod boringssl_session_handshake_error_print(205) <private>[0x7fdf854917c0] <private>

fehler 22:12:52.000745 +0100 com.apple.geod boringssl_session_errorlog(224) <private>[0x7fdf854917c0] [boringssl_session_read] SSL_ERROR_SSL(1): operation failed within the library

fehler 22:12:52.000842 +0100 com.apple.geod boringssl_session_handshake_error_print(205) <private>[0x7fdf854917c0] <private>

fehler 22:12:52.001526 +0100 com.apple.geod boringssl_session_errorlog(224) <private>[0x7faca7009330] [boringssl_session_read] SSL_ERROR_SSL(1): operation failed within the library

fehler 22:12:52.001581 +0100 com.apple.geod boringssl_session_handshake_error_print(205) <private>[0x7faca7009330] <private>

fehler 22:12:52.001636 +0100 com.apple.geod boringssl_session_errorlog(224) <private>[0x7faca7009330] [boringssl_session_read] SSL_ERROR_SSL(1): operation failed within the library

fehler 22:12:52.001686 +0100 com.apple.geod boringssl_session_handshake_error_print(205) <private>[0x7faca7009330] <private>

fehler 22:12:52.002644 +0100 com.apple.geod boringssl_session_errorlog(224) <private>[0x7fdf854917c0] [boringssl_session_read] SSL_ERROR_SSL(1): operation failed within the library

fehler 22:12:52.002697 +0100 com.apple.geod boringssl_session_handshake_error_print(205) <private>[0x7fdf854917c0] <private>

fehler 22:12:52.002751 +0100 com.apple.geod boringssl_session_errorlog(224) <private>[0x7fdf854917c0] [boringssl_session_read] SSL_ERROR_SSL(1): operation failed within the library

fehler 22:12:52.002805 +0100 com.apple.geod boringssl_session_handshake_error_print(205) <private>[0x7fdf854917c0] <private>

fehler 22:12:52.008249 +0100 com.apple.geod boringssl_session_errorlog(224) <private>[0x7f87f166f220] [boringssl_session_read] SSL_ERROR_SSL(1): operation failed within the library

fehler 22:12:52.008302 +0100 com.apple.geod boringssl_session_handshake_error_print(205) <private>[0x7f87f166f220] <private>

fehler 22:12:52.008357 +0100 com.apple.geod boringssl_session_errorlog(224) <private>[0x7f87f166f220] [boringssl_session_read] SSL_ERROR_SSL(1): operation failed within the library

fehler 22:12:52.008408 +0100 com.apple.geod boringssl_session_handshake_error_print(205) <private>[0x7f87f166f220] <private>

fehler 22:12:52.009117 +0100 com.apple.geod boringssl_session_errorlog(224) <private>[0x7f87f166f220] [boringssl_session_read] SSL_ERROR_SSL(1): operation failed within the library

fehler 22:12:52.009165 +0100 com.apple.geod boringssl_session_handshake_error_print(205) <private>[0x7f87f166f220] <private>

fehler 22:12:52.009214 +0100 com.apple.geod boringssl_session_errorlog(224) <private>[0x7f87f166f220] [boringssl_session_read] SSL_ERROR_SSL(1): operation failed within the library

fehler 22:12:52.009251 +0100 com.apple.geod boringssl_session_handshake_error_print(205) <private>[0x7f87f166f220] <private>

fehler 22:12:53.088289 +0100 timed Command 'TMSetAuthenticatedSourceTime' included mach time when not expected, forcing conversion

fehler 22:12:53.246590 +0100 IMRemoteURLConnectionAgent Denying xpc connection, task does not have entitlement: com.apple.private.imcore.imremoteurlconnection  (callservicesd:393)

fehler 22:12:53.247277 +0100 IMRemoteURLConnectionAgent Denying xpc connection, task does not have entitlement: com.apple.private.imcore.imremoteurlconnection  (callservicesd:393)

fehler 22:12:53.250021 +0100 callservicesd Remote loader crashed for request: <NSMutableURLRequest: 0x7fd7f2700370> { URL: http://init.ess.apple.com/WebObjects/VCInit.woa/wa/getBag?ix=4 }

fehler 22:12:53.250282 +0100 callservicesd => Retrying... (3/5) retries

fehler 22:12:53.250740 +0100 IMRemoteURLConnectionAgent Denying xpc connection, task does not have entitlement: com.apple.private.imcore.imremoteurlconnection  (callservicesd:393)

fehler 22:12:53.251961 +0100 IMRemoteURLConnectionAgent Denying xpc connection, task does not have entitlement: com.apple.private.imcore.imremoteurlconnection  (callservicesd:393)

fehler 22:12:53.260369 +0100 callservicesd Remote loader crashed for request: <NSMutableURLRequest: 0x7fd7f252af40> { URL: http://init-p01md.apple.com/bag }

fehler 22:12:53.261356 +0100 callservicesd => Retrying... (3/5) retries

fehler 22:12:53.428811 +0100 timed Command 'TMSetAuthenticatedSourceTime' included mach time when not expected, forcing conversion

fehler 22:12:53.845038 +0100 timed Command 'TMSetAuthenticatedSourceTime' included mach time when not expected, forcing conversion

fehler 22:12:54.713634 +0100 dasd Activity <private> not tracked as being started, ignoring it

fehler 22:12:54.799766 +0100 timed Command 'TMSetAuthenticatedSourceTime' included mach time when not expected, forcing conversion

fehler 22:12:56.219043 +0100 cfprefsd rejecting read of { kCFPreferencesAnyApplication, severinkampfer, kCFPreferencesAnyHost, no container, managed: 0 } from process 568 because accessing preferences outside an application's container requires user-preference-read or file-read-data sandbox access

fehler 22:12:56.219578 +0100 suggestd Couldn't read values in CFPrefsPlistSource<0x7ff1b8f00df0> (Domain: kCFPreferencesAnyApplication, User: kCFPreferencesCurrentUser, ByHost: No, Container: (null), Contents Need Refresh: Yes): accessing preferences outside an application's container requires user-preference-read or file-read-data sandbox access

fehler 22:12:56.238530 +0100 apsd <APSPreferences: 0x7fcc1b400700>: Preferences may have changed, checking for any relevant changes

fehler 22:12:56.281665 +0100 apsd <APSPreferences: 0x7fcc1b400700>: Preferences may have changed, checking for any relevant changes

fehler 22:12:56.356594 +0100 apsd <APSPreferences: 0x7fcc1b400700>: Preferences may have changed, checking for any relevant changes

fehler 22:12:59.252281 +0100 IMRemoteURLConnectionAgent Denying xpc connection, task does not have entitlement: com.apple.private.imcore.imremoteurlconnection  (callservicesd:393)

fehler 22:12:59.252773 +0100 callservicesd Remote loader crashed for request: <NSMutableURLRequest: 0x7fd7f2700370> { URL: http://init.ess.apple.com/WebObjects/VCInit.woa/wa/getBag?ix=4 }

fehler 22:12:59.252993 +0100 IMRemoteURLConnectionAgent Denying xpc connection, task does not have entitlement: com.apple.private.imcore.imremoteurlconnection  (callservicesd:393)

fehler 22:12:59.253262 +0100 callservicesd => Retrying... (4/5) retries

fehler 22:12:59.863941 +0100 IMRemoteURLConnectionAgent Denying xpc connection, task does not have entitlement: com.apple.private.imcore.imremoteurlconnection  (callservicesd:393)

fehler 22:12:59.864252 +0100 callservicesd Remote loader crashed for request: <NSMutableURLRequest: 0x7fd7f252af40> { URL: http://init-p01md.apple.com/bag }

fehler 22:12:59.864461 +0100 IMRemoteURLConnectionAgent Denying xpc connection, task does not have entitlement: com.apple.private.imcore.imremoteurlconnection  (callservicesd:393)

fehler 22:12:59.864438 +0100 callservicesd => Retrying... (4/5) retries

problem 22:13:01.039981 +0100 locationd wifi scan failed with error: Error Domain=NSPOSIXErrorDomain Code=16 "Resource busy"

Download
memcantgetreserved
mm.txt
Text Dokument 90.1 KB

Kommentar schreiben

Kommentare: 1
  • #1

    Johanna (Mittwoch, 07 November 2018 17:46)

    Fehler: Der/die Partition(en) 1, 2, 3, 4, 5, 6, 7, 8, 9, 10, 11, 12, 13, 14, 15,
    16, 17, 18, 19, 20, 21, 22, 23, 24, 25, 26, 27, 28, 29, 30, 31, 32, 33, 34, 35,
    36, 37, 38, 39, 40, 41, 42, 43, 44, 45, 46, 47, 48, 49, 50, 51, 52, 53, 54, 55,
    56, 57, 58, 59, 60, 61, 62, 63, 64 auf /dev/sdb1 wurden geschrieben, aber es war
    nicht möglich, den Kernel über die Änderungen zu informieren, weil sie
    wahrscheinlich in Benutzung sind. Daher werden die alten Partitionen noch
    benutzt. Sie sollten nun den Rechner neu starten, bevor Sie weitere Änderungen
    vornehmen.

Click the button

Chance of Elysion | Buy my book now:

Chance of Elysion | There is only one step at a time, so Cooper manages to find some relief knowing that there is only one intruder.  Still, the unknown whereabouts of O`Brien keep him at the edge, making him lean some more out of his hideout towards the
Me with my book | Chance of Elysion | There is only one step at a time, so Cooper manages to find some relief knowing that there is only one intruder. Still, the unknown whereabouts of O`Brien keep him at the edge, making him lean some more out of his hi

TRAPPIST-1 E is a new chance for humanity and scientists finally found a way how to reach that place. In Elysion town they build the first human colony outside of earths star- system. But shortly before arriving on TRAPPIST-1 E, they meet an old friend: Greed and Hate. There is an explosion on the colony ship and on the planet the colony is repeatedly attacked for no reason by traitors, the separatists. When the Separatists send an encrypted signal to Earth, the mayor of Elysion Town, Cooper, begins the rescue of the colony from which they fled from Earth. Can humanity change or is this its nature? Cooper needs to rescue his daughter Sophie from the hands of the separatists and wants to keep her, as well as her little sister Shannon, from suddenly becoming a copy of the destroyed and exploited first earth.

Chance of Elysion | An event like this was supposed to happen. A revolution is always waiting to explode. | TRAPPIST-1 E is a new chance for humanity and scientists finally found a way how to reach that place. In Elysion town they build the first human co
Chance of Elysion by Severin Kämpfer


KONTAKT

Bitte den Code eingeben:

Hinweis: Bitte die mit * gekennzeichneten Felder ausfüllen.


ADCELL

Hey! Thats me!

Severin Kämpfer Bremgarten bei Bern

17 years old trekkie.

Persönliche Webseite:

https://www.severin-kaempfer.ch

Unterstütze KKTVCAM mit 1 CHF! Bezahle mit Bitcoin!



Made with ♥ in Bern (Switzerland)!

KKTVCAM ÜBERNIMMT KEINE HAFTUNG FÜR ALLE ANGABEN AUF DIESER SEITE.